Home

Andrew Halliday Vouloir conseillé google protobuf port_def inc no such file or directory Volonté miroir de porte lancement

Make px4_sitl gazebo error - Discussion Forum for PX4, Pixhawk,  QGroundControl, MAVSDK, MAVLink
Make px4_sitl gazebo error - Discussion Forum for PX4, Pixhawk, QGroundControl, MAVSDK, MAVLink

win10下ProtoBuf 安装编译测试_make target '../../include/google/protobuf /port_de_qq_34732729的博客-CSDN博客
win10下ProtoBuf 安装编译测试_make target '../../include/google/protobuf /port_de_qq_34732729的博客-CSDN博客

Get started with gRPC in C++. One-stop guide to writing a gRPC… | by  Shradha Sehgal | Medium
Get started with gRPC in C++. One-stop guide to writing a gRPC… | by Shradha Sehgal | Medium

caffe编译问题汇总- 简书
caffe编译问题汇总- 简书

google/protobuf/port_def.inc no such file or directory tensorflow-掘金
google/protobuf/port_def.inc no such file or directory tensorflow-掘金

caffe编译问题汇总- 简书
caffe编译问题汇总- 简书

Ubuntu install instructions (for 21.10) · Issue #500 · USBGuard/usbguard ·  GitHub
Ubuntu install instructions (for 21.10) · Issue #500 · USBGuard/usbguard · GitHub

Cant run cmake.... · Issue #303 · ketoo/NoahGameFrame · GitHub
Cant run cmake.... · Issue #303 · ketoo/NoahGameFrame · GitHub

arm编译ncnn解决fatal error: google/protobuf/port_def.inc: no such file or  directory_雪回的博客-CSDN博客
arm编译ncnn解决fatal error: google/protobuf/port_def.inc: no such file or directory_雪回的博客-CSDN博客

fatal error: google/protobuf/port_def.inc: No such file or directory  compilation terminated. · Issue #6774 · BVLC/caffe · GitHub
fatal error: google/protobuf/port_def.inc: No such file or directory compilation terminated. · Issue #6774 · BVLC/caffe · GitHub

arm编译ncnn解决fatal error: google/protobuf/port_def.inc: no such file or  directory_雪回的博客-CSDN博客
arm编译ncnn解决fatal error: google/protobuf/port_def.inc: no such file or directory_雪回的博客-CSDN博客

2020年如何编译Cuda版OpenPose - 知乎
2020年如何编译Cuda版OpenPose - 知乎

bug(windows): fatal error C1083: Cannot open include file: 'google/protobuf/ port_def.inc': No such file or directory · Issue #17 · bsolomon1124/pycld3  · GitHub
bug(windows): fatal error C1083: Cannot open include file: 'google/protobuf/ port_def.inc': No such file or directory · Issue #17 · bsolomon1124/pycld3 · GitHub

google/protobuf/port_def.inc' file not found · Issue #5868 ·  protocolbuffers/protobuf · GitHub
google/protobuf/port_def.inc' file not found · Issue #5868 · protocolbuffers/protobuf · GitHub

win10下ProtoBuf 安装编译测试_make target '../../include/google/protobuf /port_de_qq_34732729的博客-CSDN博客
win10下ProtoBuf 安装编译测试_make target '../../include/google/protobuf /port_de_qq_34732729的博客-CSDN博客

arm编译ncnn解决fatal error: google/protobuf/port_def.inc: no such file or  directory_雪回的博客-CSDN博客
arm编译ncnn解决fatal error: google/protobuf/port_def.inc: no such file or directory_雪回的博客-CSDN博客

protobuf中没有port_undef.inc文件_port_def.inc_修炼之路的博客-CSDN博客
protobuf中没有port_undef.inc文件_port_def.inc_修炼之路的博客-CSDN博客

win10下ProtoBuf 安装编译测试_make target '../../include/google/protobuf /port_de_qq_34732729的博客-CSDN博客
win10下ProtoBuf 安装编译测试_make target '../../include/google/protobuf /port_de_qq_34732729的博客-CSDN博客

bug(windows): fatal error C1083: Cannot open include file: 'google/protobuf/ port_def.inc': No such file or directory · Issue #17 · bsolomon1124/pycld3  · GitHub
bug(windows): fatal error C1083: Cannot open include file: 'google/protobuf/ port_def.inc': No such file or directory · Issue #17 · bsolomon1124/pycld3 · GitHub

fatal error: google/protobuf/port_def.inc: No such file or directory ·  Issue #37 · tkn-tub/ns3-gym · GitHub
fatal error: google/protobuf/port_def.inc: No such file or directory · Issue #37 · tkn-tub/ns3-gym · GitHub

arm编译ncnn解决fatal error: google/protobuf/port_def.inc: no such file or  directory_雪回的博客-CSDN博客
arm编译ncnn解决fatal error: google/protobuf/port_def.inc: no such file or directory_雪回的博客-CSDN博客

google/protobuf/port_def.inc' file not found · Issue #5868 ·  protocolbuffers/protobuf · GitHub
google/protobuf/port_def.inc' file not found · Issue #5868 · protocolbuffers/protobuf · GitHub

fatal error: google/protobuf/port_def.inc: No such file or directory  compilation terminated. · Issue #6774 · BVLC/caffe · GitHub
fatal error: google/protobuf/port_def.inc: No such file or directory compilation terminated. · Issue #6774 · BVLC/caffe · GitHub

cpp client] fatal error: google/protobuf/port_def.inc: No such file or  directory · Issue #4647 · apache/pulsar · GitHub
cpp client] fatal error: google/protobuf/port_def.inc: No such file or directory · Issue #4647 · apache/pulsar · GitHub

python pycld3安装】win 10安装python库pycld3报错_东华果汁哥的博客-CSDN博客
python pycld3安装】win 10安装python库pycld3报错_东华果汁哥的博客-CSDN博客

fatal error: google/protobuf/port_def.inc: No such file or directory  compilation terminated. · Issue #6774 · BVLC/caffe · GitHub
fatal error: google/protobuf/port_def.inc: No such file or directory compilation terminated. · Issue #6774 · BVLC/caffe · GitHub

psdk-07.03.00.07 (13 Apr 2021) -> tidl build error: "fatal error: google/ protobuf/port_def.inc: No such file or directory" - Processors forum -  Processors - TI E2E support forums
psdk-07.03.00.07 (13 Apr 2021) -> tidl build error: "fatal error: google/ protobuf/port_def.inc: No such file or directory" - Processors forum - Processors - TI E2E support forums

win10下ProtoBuf 安装编译测试_make target '../../include/google/protobuf /port_de_qq_34732729的博客-CSDN博客
win10下ProtoBuf 安装编译测试_make target '../../include/google/protobuf /port_de_qq_34732729的博客-CSDN博客